{"text_format":"1","workbook":"xlsx","n_sheets":5,"sheets":["S6","Company Logo","Importer","Lists","checker"],"not_rendered":{"charts":0,"images":3,"macros":1,"external_links":0,"defined_names":10,"comments":0,"pivot_tables":0},"unopened":[],"bounds":{"document_bytes":16777216,"sheet_cells":100000,"rows_first":2000,"rows_last":500,"rows_between":2000,"halvings":0,"cell_chars":16384,"cell_head_chars":4096},"cells_cut":0,"cells_raw":0,"read":"whole","date_system":"1900"}

{"sheet":"S6","index":0,"n_rows":1011,"n_cols":23,"rows_kept":1011,"cut":false,"hidden":false,"merged":[[2,0,2,5],[0,1,0,5],[9,0,9,10],[3,0,3,1],[3,4,3,5],[4,4,4,5],[5,4,5,5],[6,4,6,5],[7,4,7,5]]}
[null,"S6 - Vehicle Safety Equipment",null,null,null,null,null,"Version","1.7.4"]
[]
["In addition to the evidence below, Members shall upload a sample of photographic evidence showing a typical example of safety equipment fitted across the fleet and should upload evidencing receipts.",null,null,null,null,null,null,{"$f":"IF(N8>0,\"Data Errors:\",\"\")","v":""},{"$f":"IF(P9>0,\"Compliance Issues:\",\"\")","v":""},null," "]
["I certify that all the information below is correct and refers to vehicles declared in the scope of accreditation.",null,null,"Full Name",null,null,null,{"$f":"IF(N8>0,N8,\"\")","v":""},{"$f":"IF(P9>0,P9,\"\")","v":""}]
[]
[null,null,null,"*Total number of vehicles held at the operating centre","Do not enter figures: these will be \ncalculated using the table below",null,null,"Key:"]
[null,null,null,"**Total number of vehicles under 3,500kgs",{"$f":"SUM(L12:L1011)","v":0},null,null,"A User data entry","A Compliance issue",null,null,null,null,"Missing data count"]
[null,null,null,"**Total number of vehicles over 3,500kgs",{"$f":"SUM(M12:M1011)","v":0},null,null,"A Positive response","A Negative response",null,null,null,null,{"$f":"COUNTIF($N$12:$N$1011,\">0\")","v":0},null,"Total compliance issues:","Compliance checker"]
[null,null,null,null,null,null,null,null,null,null,null,null,null,null,null,{"$f":"SUM(P12:P1011)","v":0},"1=error,0=ok"]
["Table fields required to be filled out by the operator"]
["Vehicle Registration Mark (text)","Weight (kg) / Vehicle type \n(select from the drop down options)","Registered Pre \nJanuary 2015\n(Y/N)","Side cameras required by contract (Y/N)","Audible turn left (Y/N)","Driver incab warning proximity sensors (Y/N)","Camera - rear (Y/N)","Camera - side (Y/N)","Audible reversing alarm (Y/N)","Fresnel lens (Y/N)\n[pre Jan 2015 only]","Other equipment e.g. front camera\n(optional text)","under 3.5","over 3.5","1 to 9 = error, 0=ok, -1=no data",null,"row compliance",null,"Audible turn left (Y/N)","Driver incab warning proximity sensors (Y/N)","Camera - rear (Y/N)","Camera - side (Y/N)\npost 2015","Audible reversing alarm (Y/N)","Fresnel lens (Y/N)\npre 2015\n\nOR CAMERA SIDE"]
[null,null,null,null,null,null,null,null,null,null,null,{"$f":"IF(ISNUMBER(MATCH(B12,Lists!$D$3:$D$11,0)),1,0)","v":0},{"$f":"IF(ISNUMBER(MATCH(B12,Lists!$F$3:$F$14,0)),1,0)","v":0},{"$f":"IF(COUNTBLANK(A12:J12)=10,-1,10-((2-COUNTBLANK(A12:B12))+COUNTIF(C12:J12,\"y\")+COUNTIF(C12:J12,\"n\")))","v":-1},{"$f":"IFERROR(VLOOKUP(B12,VehicleLookUp,2,FALSE),\"\")","v":""},{"$f":"SUM(Q12:W12)","v":0},null,{"$f":"IFERROR(IF( VLOOKUP($B12,CheckData,3,FALSE)=1,IF($E12=\"n\",1,0),0),0)","v":0},{"$f":"IFERROR(IF( VLOOKUP($B12,CheckData,4,FALSE)=1,IF($F12=\"n\",1,0),0),0)","v":0},{"$f":"IFERROR(IF( VLOOKUP($B12,CheckData,5,FALSE)=1,IF($G12=\"n\",1,0),0),0)","v":0},{"$f":"IFERROR(IF( OR($D12=\"y\",AND(VLOOKUP($B12,CheckData,6,FALSE)=1, $C12=\"n\")),IF($H12=\"n\",1,0),0),0)","v":0},{"$f":"IFERROR(IF( VLOOKUP($B12,CheckData,7,FALSE)=1,IF($I12=\"n\",1,0),0),0)","v":0},{"$f":"IFERROR(IF(AND( VLOOKUP($B12,CheckData,8,FALSE)=1, $C12=\"y\"),IF(AND($J12=\"n\",AND($D12=\"n\",$H12=\"n\")),1,0),0),0)","v":0}]
[null,null,null,null,null,null,null,null,null,null,null,{"$f":"IF(ISNUMBER(MATCH(B13,Lists!$D$3:$D$11,0)),1,0)","v":0},{"$f":"IF(ISNUMBER(MATCH(B13,Lists!$F$3:$F$14,0)),1,0)","v":0},{"$f":"IF(COUNTBLANK(A13:J13)=10,-1,10-((2-COUNTBLANK(A13:B13))+COUNTIF(C13:J13,\"y\")+COUNTIF(C13:J13,\"n\")))","v":-1},"",{"$f":"SUM(Q13:W13)","v":0},null,0,0,0,0,0,0]
[null,null,null,null,null,null,null,null,null,null,null,{"$f":"IF(ISNUMBER(MATCH(B14,Lists!$D$3:$D$11,0)),1,0)","v":0},{"$f":"IF(ISNUMBER(MATCH(B14,Lists!$F$3:$F$14,0)),1,0)","v":0},-1,"",0,null,0,0,0,0,0,0]
[null,null,null,null,null,null,null,null,null,null,null,{"$f":"IF(ISNUMBER(MATCH(B15,Lists!$D$3:$D$11,0)),1,0)","v":0},{"$f":"IF(ISNUMBER(MATCH(B15,Lists!$F$3:$F$14,0)),1,0)","v":0},-1,"",0,null,0,0,0,0,0,0]
[null,null,null,null,null,null,null,null,null,null,null,{"$f":"IF(ISNUMBER(MATCH(B16,Lists!$D$3:$D$11,0)),1,0)","v":0},{"$f":"IF(ISNUMBER(MATCH(B16,Lists!$F$3:$F$14,0)),1,0)","v":0},-1,"",0,null,0,0,0,0,0,0]
[null,null,null,null,null,null,null,null,null,null,null,{"$f":"IF(ISNUMBER(MATCH(B17,Lists!$D$3:$D$11,0)),1,0)","v":0},{"$f":"IF(ISNUMBER(MATCH(B17,Lists!$F$3:$F$14,0)),1,0)","v":0},-1,"",0,null,0,0,0,0,0,0]
[null,null,null,null,null,null,null,null,null,null,null,{"$f":"IF(ISNUMBER(MATCH(B18,Lists!$D$3:$D$11,0)),1,0)","v":0},{"$f":"IF(ISNUMBER(MATCH(B18,Lists!$F$3:$F$14,0)),1,0)","v":0},-1,"",0,null,0,0,0,0,0,0]
[null,null,null,null,null,null,null,null,null,null,null,{"$f":"IF(ISNUMBER(MATCH(B19,Lists!$D$3:$D$11,0)),1,0)","v":0},{"$f":"IF(ISNUMBER(MATCH(B19,Lists!$F$3:$F$14,0)),1,0)","v":0},-1,"",0,null,0,0,0,0,0,0]
[null,null,null,null,null,null,null,null,null,null,null,{"$f":"IF(ISNUMBER(MATCH(B20,Lists!$D$3:$D$11,0)),1,0)","v":0},{"$f":"IF(ISNUMBER(MATCH(B20,Lists!$F$3:$F$14,0)),1,0)","v":0},-1,"",0,null,0,0,0,0,0,0]
[null,null,null,null,null,null,null,null,null,null,null,{"$f":"IF(ISNUMBER(MATCH(B21,Lists!$D$3:$D$11,0)),1,0)","v":0},{"$f":"IF(ISNUMBER(MATCH(B21,Lists!$F$3:$F$14,0)),1,0)","v":0},-1,"",0,null,0,0,0,0,0,0]
[null,null,null,null,null,null,null,null,null,null,null,{"$f":"IF(ISNUMBER(MATCH(B22,Lists!$D$3:$D$11,0)),1,0)","v":0},{"$f":"IF(ISNUMBER(MATCH(B22,Lists!$F$3:$F$14,0)),1,0)","v":0},-1,"",0,null,0,0,0,0,0,0]
[null,null,null,null,null,null,null,null,null,null,null,{"$f":"IF(ISNUMBER(MATCH(B23,Lists!$D$3:$D$11,0)),1,0)","v":0},{"$f":"IF(ISNUMBER(MATCH(B23,Lists!$F$3:$F$14,0)),1,0)","v":0},-1,"",0,null,0,0,0,0,0,0]
[null,null,null,null,null,null,null,null,null,null,null,{"$f":"IF(ISNUMBER(MATCH(B24,Lists!$D$3:$D$11,0)),1,0)","v":0},{"$f":"IF(ISNUMBER(MATCH(B24,Lists!$F$3:$F$14,0)),1,0)","v":0},-1,"",0,null,0,0,0,0,0,0]
[null,null,null,null,null,null,null,null,null,null,null,{"$f":"IF(ISNUMBER(MATCH(B25,Lists!$D$3:$D$11,0)),1,0)","v":0},{"$f":"IF(ISNUMBER(MATCH(B25,Lists!$F$3:$F$14,0)),1,0)","v":0},-1,"",0,null,0,0,0,0,0,0]
[null,null,null,null,null,null,null,null,null,null,null,{"$f":"IF(ISNUMBER(MATCH(B26,Lists!$D$3:$D$11,0)),1,0)","v":0},{"$f":"IF(ISNUMBER(MATCH(B26,Lists!$F$3:$F$14,0)),1,0)","v":0},-1,"",0,null,0,0,0,0,0,0]
[null,null,null,null,null,null,null,null,null,null,null,{"$f":"IF(ISNUMBER(MATCH(B27,Lists!$D$3:$D$11,0)),1,0)","v":0},{"$f":"IF(ISNUMBER(MATCH(B27,Lists!$F$3:$F$14,0)),1,0)","v":0},-1,"",0,null,0,0,0,0,0,0]
["","",null,null,null,null,null,null,null,null,null,{"$f":"IF(ISNUMBER(MATCH(B28,Lists!$D$3:$D$11,0)),1,0)","v":0},{"$f":"IF(ISNUMBER(MATCH(B28,Lists!$F$3:$F$14,0)),1,0)","v":0},-1,"",0,null,0,0,0,0,0,0]
["","",null,null,null,null,null,null,null,null,null,{"$f":"IF(ISNUMBER(MATCH(B29,Lists!$D$3:$D$11,0)),1,0)","v":0},{"$f":"IF(ISNUMBER(MATCH(B29,Lists!$F$3:$F$14,0)),1,0)","v":0},-1,"",0,null,0,0,0,0,0,0]
["","",null,null,null,null,null,null,null,null,null,{"$f":"IF(ISNUMBER(MATCH(B30,Lists!$D$3:$D$11,0)),1,0)","v":0},{"$f":"IF(ISNUMBER(MATCH(B30,Lists!$F$3:$F$14,0)),1,0)","v":0},-1,"",0,null,0,0,0,0,0,0]
["","",null,null,null,null,null,null,null,null,null,{"$f":"IF(ISNUMBER(MATCH(B31,Lists!$D$3:$D$11,0)),1,0)","v":0},{"$f":"IF(ISNUMBER(MATCH(B31,Lists!$F$3:$F$14,0)),1,0)","v":0},-1,"",0,null,0,0,0,0,0,0]
["","",null,null,null,null,null,null,null,null,null,{"$f":"IF(ISNUMBER(MATCH(B32,Lists!$D$3:$D$11,0)),1,0)","v":0},{"$f":"IF(ISNUMBER(MATCH(B32,Lists!$F$3:$F$14,0)),1,0)","v":0},-1,"",0,null,0,0,0,0,0,0]
["","",null,null,null,null,null,null,null,null,null,{"$f":"IF(ISNUMBER(MATCH(B33,Lists!$D$3:$D$11,0)),1,0)","v":0},{"$f":"IF(ISNUMBER(MATCH(B33,Lists!$F$3:$F$14,0)),1,0)","v":0},-1,"",0,null,0,0,0,0,0,0]
["","",null,null,null,null,null,null,null,null,null,{"$f":"IF(ISNUMBER(MATCH(B34,Lists!$D$3:$D$11,0)),1,0)","v":0},{"$f":"IF(ISNUMBER(MATCH(B34,Lists!$F$3:$F$14,0)),1,0)","v":0},-1,"",0,null,0,0,0,0,0,0]
["","",null,null,null,null,null,null,null,null,null,{"$f":"IF(ISNUMBER(MATCH(B35,Lists!$D$3:$D$11,0)),1,0)","v":0},{"$f":"IF(ISNUMBER(MATCH(B35,Lists!$F$3:$F$14,0)),1,0)","v":0},-1,"",0,null,0,0,0,0,0,0]
["","",null,null,null,null,null,null,null,null,null,{"$f":"IF(ISNUMBER(MATCH(B36,Lists!$D$3:$D$11,0)),1,0)","v":0},{"$f":"IF(ISNUMBER(MATCH(B36,Lists!$F$3:$F$14,0)),1,0)","v":0},-1,"",0,null,0,0,0,0,0,0]
["","",null,null,null,null,null,null,null,null,null,{"$f":"IF(ISNUMBER(MATCH(B37,Lists!$D$3:$D$11,0)),1,0)","v":0},{"$f":"IF(ISNUMBER(MATCH(B37,Lists!$F$3:$F$14,0)),1,0)","v":0},-1,"",0,null,0,0,0,0,0,0]
["","",null,null,null,null,null,null,null,null,null,{"$f":"IF(ISNUMBER(MATCH(B38,Lists!$D$3:$D$11,0)),1,0)","v":0},{"$f":"IF(ISNUMBER(MATCH(B38,Lists!$F$3:$F$14,0)),1,0)","v":0},-1,"",0,null,0,0,0,0,0,0]
["","",null,null,null,null,null,null,null,null,null,{"$f":"IF(ISNUMBER(MATCH(B39,Lists!$D$3:$D$11,0)),1,0)","v":0},{"$f":"IF(ISNUMBER(MATCH(B39,Lists!$F$3:$F$14,0)),1,0)","v":0},-1,"",0,null,0,0,0,0,0,0]
["","",null,null,null,null,null,null,null,null,null,{"$f":"IF(ISNUMBER(MATCH(B40,Lists!$D$3:$D$11,0)),1,0)","v":0},{"$f":"IF(ISNUMBER(MATCH(B40,Lists!$F$3:$F$14,0)),1,0)","v":0},-1,"",0,null,0,0,0,0,0,0]
["","",null,null,null,null,null,null,null,null,null,{"$f":"IF(ISNUMBER(MATCH(B41,Lists!$D$3:$D$11,0)),1,0)","v":0},{"$f":"IF(ISNUMBER(MATCH(B41,Lists!$F$3:$F$14,0)),1,0)","v":0},-1,"",0,null,0,0,0,0,0,0]
["","",null,null,null,null,null,null,null,null,null,{"$f":"IF(ISNUMBER(MATCH(B42,Lists!$D$3:$D$11,0)),1,0)","v":0},{"$f":"IF(ISNUMBER(MATCH(B42,Lists!$F$3:$F$14,0)),1,0)","v":0},-1,"",0,null,0,0,0,0,0,0]
["","",null,null,null,null,null,null,null,null,null,{"$f":"IF(ISNUMBER(MATCH(B43,Lists!$D$3:$D$11,0)),1,0)","v":0},{"$f":"IF(ISNUMBER(MATCH(B43,Lists!$F$3:$F$14,0)),1,0)","v":0},-1,"",0,null,0,0,0,0,0,0]
["","",null,null,null,null,null,null,null,null,null,{"$f":"IF(ISNUMBER(MATCH(B44,Lists!$D$3:$D$11,0)),1,0)","v":0},{"$f":"IF(ISNUMBER(MATCH(B44,Lists!$F$3:$F$14,0)),1,0)","v":0},-1,"",0,null,0,0,0,0,0,0]
["","",null,null,null,null,null,null,null,null,null,{"$f":"IF(ISNUMBER(MATCH(B45,Lists!$D$3:$D$11,0)),1,0)","v":0},{"$f":"IF(ISNUMBER(MATCH(B45,Lists!$F$3:$F$14,0)),1,0)","v":0},-1,"",0,null,0,0,0,0,0,0]
["","",null,null,null,null,null,null,null,null,null,{"$f":"IF(ISNUMBER(MATCH(B46,Lists!$D$3:$D$11,0)),1,0)","v":0},{"$f":"IF(ISNUMBER(MATCH(B46,Lists!$F$3:$F$14,0)),1,0)","v":0},-1,"",0,null,0,0,0,0,0,0]
["","",null,null,null,null,null,null,null,null,null,{"$f":"IF(ISNUMBER(MATCH(B47,Lists!$D$3:$D$11,0)),1,0)","v":0},{"$f":"IF(ISNUMBER(MATCH(B47,Lists!$F$3:$F$14,0)),1,0)","v":0},-1,"",0,null,0,0,0,0,0,0]
["","",null,null,null,null,null,null,null,null,null,{"$f":"IF(ISNUMBER(MATCH(B48,Lists!$D$3:$D$11,0)),1,0)","v":0},{"$f":"IF(ISNUMBER(MATCH(B48,Lists!$F$3:$F$14,0)),1,0)","v":0},-1,"",0,null,0,0,0,0,0,0]
["","",null,null,null,null,null,null,null,null,null,{"$f":"IF(ISNUMBER(MATCH(B49,Lists!$D$3:$D$11,0)),1,0)","v":0},{"$f":"IF(ISNUMBER(MATCH(B49,Lists!$F$3:$F$14,0)),1,0)","v":0},-1,"",0,null,0,0,0,0,0,0]
["","",null,null,null,null,null,null,null,null,null,{"$f":"IF(ISNUMBER(MATCH(B50,Lists!$D$3:$D$11,0)),1,0)","v":0},{"$f":"IF(ISNUMBER(MATCH(B50,Lists!$F$3:$F$14,0)),1,0)","v":0},-1,"",0,null,0,0,0,0,0,0]
["","",null,null,null,null,null,null,null,null,null,{"$f":"IF(ISNUMBER(MATCH(B51,Lists!$D$3:$D$11,0)),1,0)","v":0},{"$f":"IF(ISNUMBER(MATCH(B51,Lists!$F$3:$F$14,0)),1,0)","v":0},-1,"",0,null,0,0,0,0,0,0]
["","",null,null,null,null,null,null,null,null,null,{"$f":"IF(ISNUMBER(MATCH(B52,Lists!$D$3:$D$11,0)),1,0)","v":0},{"$f":"IF(ISNUMBER(MATCH(B52,Lists!$F$3:$F$14,0)),1,0)","v":0},-1,"",0,null,0,0,0,0,0,0]
["","",null,null,null,null,null,null,null,null,null,{"$f":"IF(ISNUMBER(MATCH(B53,Lists!$D$3:$D$11,0)),1,0)","v":0},{"$f":"IF(ISNUMBER(MATCH(B53,Lists!$F$3:$F$14,0)),1,0)","v":0},-1,"",0,null,0,0,0,0,0,0]
["","",null,null,null,null,null,null,null,null,null,{"$f":"IF(ISNUMBER(MATCH(B54,Lists!$D$3:$D$11,0)),1,0)","v":0},{"$f":"IF(ISNUMBER(MATCH(B54,Lists!$F$3:$F$14,0)),1,0)","v":0},-1,"",0,null,0,0,0,0,0,0]
["","",null,null,null,null,null,null,null,null,null,{"$f":"IF(ISNUMBER(MATCH(B55,Lists!$D$3:$D$11,0)),1,0)","v":0},{"$f":"IF(ISNUMBER(MATCH(B55,Lists!$F$3:$F$14,0)),1,0)","v":0},-1,"",0,null,0,0,0,0,0,0]
["","",null,null,null,null,null,null,null,null,null,{"$f":"IF(ISNUMBER(MATCH(B56,Lists!$D$3:$D$11,0)),1,0)","v":0},{"$f":"IF(ISNUMBER(MATCH(B56,Lists!$F$3:$F$14,0)),1,0)","v":0},-1,"",0,null,0,0,0,0,0,0]
["","",null,null,null,null,null,null,null,null,null,{"$f":"IF(ISNUMBER(MATCH(B57,Lists!$D$3:$D$11,0)),1,0)","v":0},{"$f":"IF(ISNUMBER(MATCH(B57,Lists!$F$3:$F$14,0)),1,0)","v":0},-1,"",0,null,0,0,0,0,0,0]
["","",null,null,null,null,null,null,null,null,null,{"$f":"IF(ISNUMBER(MATCH(B58,Lists!$D$3:$D$11,0)),1,0)","v":0},{"$f":"IF(ISNUMBER(MATCH(B58,Lists!$F$3:$F$14,0)),1,0)","v":0},-1,"",0,null,0,0,0,0,0,0]
["","",null,null,null,null,null,null,null,null,null,{"$f":"IF(ISNUMBER(MATCH(B59,Lists!$D$3:$D$11,0)),1,0)","v":0},{"$f":"IF(ISNUMBER(MATCH(B59,Lists!$F$3:$F$14,0)),1,0)","v":0},-1,"",0,null,0,0,0,0,0,0]
["","",null,null,null,null,null,null,null,null,null,{"$f":"IF(ISNUMBER(MATCH(B60,Lists!$D$3:$D$11,0)),1,0)","v":0},{"$f":"IF(ISNUMBER(MATCH(B60,Lists!$F$3:$F$14,0)),1,0)","v":0},-1,"",0,null,0,0,0,0,0,0]
["","",null,null,null,null,null,null,null,null,null,{"$f":"IF(ISNUMBER(MATCH(B61,Lists!$D$3:$D$11,0)),1,0)","v":0},{"$f":"IF(ISNUMBER(MATCH(B61,Lists!$F$3:$F$14,0)),1,0)","v":0},-1,"",0,null,0,0,0,0,0,0]
["","",null,null,null,null,null,null,null,null,null,{"$f":"IF(ISNUMBER(MATCH(B62,Lists!$D$3:$D$11,0)),1,0)","v":0},{"$f":"IF(ISNUMBER(MATCH(B62,Lists!$F$3:$F$14,0)),1,0)","v":0},-1,"",0,null,0,0,0,0,0,0]
["","",null,null,null,null,null,null,null,null,null,{"$f":"IF(ISNUMBER(MATCH(B63,Lists!$D$3:$D$11,0)),1,0)","v":0},{"$f":"IF(ISNUMBER(MATCH(B63,Lists!$F$3:$F$14,0)),1,0)","v":0},-1,"",0,null,0,0,0,0,0,0]
["","",null,null,null,null,null,null,null,null,null,{"$f":"IF(ISNUMBER(MATCH(B64,Lists!$D$3:$D$11,0)),1,0)","v":0},{"$f":"IF(ISNUMBER(MATCH(B64,Lists!$F$3:$F$14,0)),1,0)","v":0},-1,"",0,null,0,0,0,0,0,0]
["","",null,null,null,null,null,null,null,null,null,{"$f":"IF(ISNUMBER(MATCH(B65,Lists!$D$3:$D$11,0)),1,0)","v":0},{"$f":"IF(ISNUMBER(MATCH(B65,Lists!$F$3:$F$14,0)),1,0)","v":0},-1,"",0,null,0,0,0,0,0,0]
["","",null,null,null,null,null,null,null,null,null,{"$f":"IF(ISNUMBER(MATCH(B66,Lists!$D$3:$D$11,0)),1,0)","v":0},{"$f":"IF(ISNUMBER(MATCH(B66,Lists!$F$3:$F$14,0)),1,0)","v":0},-1,"",0,null,0,0,0,0,0,0]
["","",null,null,null,null,null,null,null,null,null,{"$f":"IF(ISNUMBER(MATCH(B67,Lists!$D$3:$D$11,0)),1,0)","v":0},{"$f":"IF(ISNUMBER(MATCH(B67,Lists!$F$3:$F$14,0)),1,0)","v":0},-1,"",0,null,0,0,0,0,0,0]
["","",null,null,null,null,null,null,null,null,null,{"$f":"IF(ISNUMBER(MATCH(B68,Lists!$D$3:$D$11,0)),1,0)","v":0},{"$f":"IF(ISNUMBER(MATCH(B68,Lists!$F$3:$F$14,0)),1,0)","v":0},-1,"",0,null,0,0,0,0,0,0]
["","",null,null,null,null,null,null,null,null,null,{"$f":"IF(ISNUMBER(MATCH(B69,Lists!$D$3:$D$11,0)),1,0)","v":0},{"$f":"IF(ISNUMBER(MATCH(B69,Lists!$F$3:$F$14,0)),1,0)","v":0},-1,"",0,null,0,0,0,0,0,0]
["","",null,null,null,null,null,null,null,null,null,{"$f":"IF(ISNUMBER(MATCH(B70,Lists!$D$3:$D$11,0)),1,0)","v":0},{"$f":"IF(ISNUMBER(MATCH(B70,Lists!$F$3:$F$14,0)),1,0)","v":0},-1,"",0,null,0,0,0,0,0,0]
["","",null,null,null,null,null,null,null,null,null,{"$f":"IF(ISNUMBER(MATCH(B71,Lists!$D$3:$D$11,0)),1,0)","v":0},{"$f":"IF(ISNUMBER(MATCH(B71,Lists!$F$3:$F$14,0)),1,0)","v":0},-1,"",0,null,0,0,0,0,0,0]
["","",null,null,null,null,null,null,null,null,null,{"$f":"IF(ISNUMBER(MATCH(B72,Lists!$D$3:$D$11,0)),1,0)","v":0},{"$f":"IF(ISNUMBER(MATCH(B72,Lists!$F$3:$F$14,0)),1,0)","v":0},-1,"",0,null,0,0,0,0,0,0]
["","",null,null,null,null,null,null,null,null,null,{"$f":"IF(ISNUMBER(MATCH(B73,Lists!$D$3:$D$11,0)),1,0)","v":0},{"$f":"IF(ISNUMBER(MATCH(B73,Lists!$F$3:$F$14,0)),1,0)","v":0},-1,"",0,null,0,0,0,0,0,0]
["","",null,null,null,null,null,null,null,null,null,{"$f":"IF(ISNUMBER(MATCH(B74,Lists!$D$3:$D$11,0)),1,0)","v":0},{"$f":"IF(ISNUMBER(MATCH(B74,Lists!$F$3:$F$14,0)),1,0)","v":0},-1,"",0,null,0,0,0,0,0,0]
["","",null,null,null,null,null,null,null,null,null,{"$f":"IF(ISNUMBER(MATCH(B75,Lists!$D$3:$D$11,0)),1,0)","v":0},{"$f":"IF(ISNUMBER(MATCH(B75,Lists!$F$3:$F$14,0)),1,0)","v":0},-1,{"$f":"IFERROR(VLOOKUP(B75,VehicleLookUp,2,FALSE),\"\")","v":""},0,null,0,0,0,0,0,0]
["","",null,null,null,null,null,null,null,null,null,{"$f":"IF(ISNUMBER(MATCH(B76,Lists!$D$3:$D$11,0)),1,0)","v":0},{"$f":"IF(ISNUMBER(MATCH(B76,Lists!$F$3:$F$14,0)),1,0)","v":0},-1,"",0,null,{"$f":"IFERROR(IF( VLOOKUP($B76,CheckData,3,FALSE)=1,IF($E76=\"n\",1,0),0),0)","v":0},{"$f":"IFERROR(IF( VLOOKUP($B76,CheckData,4,FALSE)=1,IF($F76=\"n\",1,0),0),0)","v":0},{"$f":"IFERROR(IF( VLOOKUP($B76,CheckData,5,FALSE)=1,IF($G76=\"n\",1,0),0),0)","v":0},{"$f":"IFERROR(IF( OR($D76=\"y\",AND(VLOOKUP($B76,CheckData,6,FALSE)=1, $C76=\"n\")),IF($H76=\"n\",1,0),0),0)","v":0},{"$f":"IFERROR(IF( VLOOKUP($B76,CheckData,7,FALSE)=1,IF($I76=\"n\",1,0),0),0)","v":0},{"$f":"IFERROR(IF(AND( VLOOKUP($B76,CheckData,8,FALSE)=1, $C76=\"y\"),IF(AND($J76=\"n\",AND($D76=\"n\",$H76=\"n\")),1,0),0),0)","v":0}]
["","",null,null,null,null,null,null,null,null,null,{"$f":"IF(ISNUMBER(MATCH(B77,Lists!$D$3:$D$11,0)),1,0)","v":0},{"$f":"IF(ISNUMBER(MATCH(B77,Lists!$F$3:$F$14,0)),1,0)","v":0},{"$f":"IF(COUNTBLANK(A77:J77)=10,-1,10-((2-COUNTBLANK(A77:B77))+COUNTIF(C77:J77,\"y\")+COUNTIF(C77:J77,\"n\")))","v":-1},"",{"$f":"SUM(Q77:W77)","v":0},null,0,0,0,0,0,0]
["","",null,null,null,null,null,null,null,null,null,{"$f":"IF(ISNUMBER(MATCH(B78,Lists!$D$3:$D$11,0)),1,0)","v":0},{"$f":"IF(ISNUMBER(MATCH(B78,Lists!$F$3:$F$14,0)),1,0)","v":0},-1,"",0,null,0,0,0,0,0,0]
["","",null,null,null,null,null,null,null,null,null,{"$f":"IF(ISNUMBER(MATCH(B79,Lists!$D$3:$D$11,0)),1,0)","v":0},{"$f":"IF(ISNUMBER(MATCH(B79,Lists!$F$3:$F$14,0)),1,0)","v":0},-1,"",0,null,0,0,0,0,0,0]
["","",null,null,null,null,null,null,null,null,null,{"$f":"IF(ISNUMBER(MATCH(B80,Lists!$D$3:$D$11,0)),1,0)","v":0},{"$f":"IF(ISNUMBER(MATCH(B80,Lists!$F$3:$F$14,0)),1,0)","v":0},-1,"",0,null,0,0,0,0,0,0]
{"$rows_left_out":932}
{"sheet":"Company Logo","index":1,"n_rows":3,"n_cols":2,"rows_kept":3,"cut":false,"hidden":false,"merged":[]}
[]
[]
[null,"Copy and Paste your company logo (if available) into the box below.  Position and resize as needed."]

{"sheet":"Importer","index":2,"n_rows":1031,"n_cols":6,"rows_kept":1031,"cut":false,"hidden":false,"merged":[]}
[null,"Data Importer"]
[]
[null,"Use this sheet to match your vehicle designation to the FORS one.  Paste in your vehicle list (Registration\\Type) and it will convert it for you."]
[]
[null,"Your Designation","Our Designation"]
[null,null,{"$f":"Lists!A3","v":"Van: Light < 1.8T"}]
[null,null,{"$f":"Lists!A4","v":"Van: Medium 1.8T to 2.6T"}]
[null,null,{"$f":"Lists!A5","v":"Van: Heavy 2.6T to 3.5T"}]
[null,null,{"$f":"Lists!A6","v":"Lorry: Rigid HGV 3.5T to 7.5T"}]
[null,null,{"$f":"Lists!A7","v":"Lorry: Rigid HGV 7.5T to 18T"}]
[null,null,{"$f":"Lists!A8","v":"Lorry: Rigid HGV 18T to 26T"}]
[null,null,{"$f":"Lists!A9","v":"Lorry: Rigid HGV 26T to 32T"}]
[null,null,{"$f":"Lists!A10","v":"Lorry: Articulated < 26T"}]
[null,null,{"$f":"Lists!A11","v":"Lorry: Articulated 26T to 38T"}]
[null,null,{"$f":"Lists!A12","v":"Lorry: Articulated 38T to 44T"}]
[null,null,{"$f":"Lists!A13","v":"Lorry: Articulated > 44T"}]
[null,null,{"$f":"Lists!A14","v":"Lorry: Drawbar HGV < 26T"}]
[null,null,{"$f":"Lists!A15","v":"Lorry: Drawbar HGV 26T to 38T"}]
[null,null,{"$f":"Lists!A16","v":"Lorry: Drawbar HGV 38T to 44T"}]
[null,null,{"$f":"Lists!A17","v":"Bus: 17 passenger seats and over"}]
[null,null,{"$f":"Lists!A18","v":"Coach: 17 passenger seats and over"}]
[null,null,{"$f":"Lists!A19","v":"Minibus: 9 -16 passenger seats"}]
[null,null,{"$f":"Lists!A20","v":"Car: up to 8 passenger seats"}]
[null,null,{"$f":"Lists!A21","v":"P2W (Motorcycle)"}]
[null,null,{"$f":"Lists!A22","v":"Trailer"}]
[null,null,{"$f":"Lists!A23","v":"Other"},null,"Copy this converted data and paste (as values) into the S6 template"]
[]
[]
[null,"Paste your original data here"]
[]
[null,"Vehicle registration","Vehicle type (Your Designation)",null,"Vehicle registration","Vehicle type (Our Designation)"]
[null,null,null,null,{"$f":"IF(ISBLANK(B32),\"\",B32)","v":""},{"$f":"IFERROR(VLOOKUP(C32,VehicleMatcher,2,FALSE),\"\")","v":""}]
[null,null,null,null,"",""]
[null,null,null,null,"",""]
[null,null,null,null,"",""]
[null,null,null,null,"",""]
[null,null,null,null,{"$f":"IF(ISBLANK(B37),\"\",B37)","v":""},""]
[null,null,null,null,"",""]
[null,null,null,null,"",""]
[null,null,null,null,"",""]
[null,null,null,null,"",""]
[null,null,null,null,"",""]
[null,null,null,null,"",""]
[null,null,null,null,{"$f":"IF(ISBLANK(B44),\"\",B44)","v":""},{"$f":"IFERROR(VLOOKUP(C44,VehicleMatcher,2,FALSE),\"\")","v":""}]
[null,null,null,null,"",""]
[null,null,null,null,"",""]
[null,null,null,null,"",""]
[null,null,null,null,"",""]
[null,null,null,null,"",""]
[null,null,null,null,"",""]
[null,null,null,null,"",""]
[null,null,null,null,"",""]
[null,null,null,null,"",""]
[null,null,null,null,"",""]
[null,null,null,null,"",""]
[null,null,null,null,"",""]
[null,null,null,null,"",""]
[null,null,null,null,"",""]
[null,null,null,null,"",""]
[null,null,null,null,"",""]
[null,null,null,null,"",""]
[null,null,null,null,"",""]
[null,null,null,null,"",""]
[null,null,null,null,"",""]
[null,null,null,null,"",""]
[null,null,null,null,"",""]
[null,null,null,null,"",""]
[null,null,null,null,"",""]
[null,null,null,null,"",""]
[null,null,null,null,"",""]
[null,null,null,null,"",""]
[null,null,null,null,"",""]
[null,null,null,null,"",""]
[null,null,null,null,"",""]
[null,null,null,null,"",""]
[null,null,null,null,"",""]
[null,null,null,null,"",""]
[null,null,null,null,"",""]
[null,null,null,null,"",""]
[null,null,null,null,"",""]
{"$rows_left_out":952}
{"sheet":"Lists","index":3,"n_rows":23,"n_cols":6,"rows_kept":23,"cut":false,"hidden":true,"merged":[]}
["Vehicles List:",null,null,"Vehicles under 3,500kgs",null,"Vehicles over 3,500kgs"]
[]
["Van: Light < 1.8T","V",null,"Van: Light < 1.8T",null,"Lorry: Rigid HGV 3.5T to 7.5T"]
["Van: Medium 1.8T to 2.6T","V1-8",null,"Van: Medium 1.8T to 2.6T",null,"Lorry: Rigid HGV 7.5T to 18T"]
["Van: Heavy 2.6T to 3.5T","V2-6",null,"Van: Heavy 2.6T to 3.5T",null,"Lorry: Rigid HGV 18T to 26T"]
["Lorry: Rigid HGV 3.5T to 7.5T","LR3-5",null,"Bus: 17 passenger seats and over",null,"Lorry: Rigid HGV 26T to 32T"]
["Lorry: Rigid HGV 7.5T to 18T","LR7-5",null,"Minibus: 9 -16 passenger seats",null,"Lorry: Articulated < 26T"]
["Lorry: Rigid HGV 18T to 26T","LR18",null,"Car: up to 8 passenger seats",null,"Lorry: Articulated 26T to 38T"]
["Lorry: Rigid HGV 26T to 32T","LR26",null,"Motorcycle",null,"Lorry: Articulated 38T to 44T"]
["Lorry: Articulated < 26T","LA",null,"Trailer",null,"Lorry: Articulated > 44T"]
["Lorry: Articulated 26T to 38T","LA26",null,"Other",null,"Lorry: Drawbar HGV < 26T"]
["Lorry: Articulated 38T to 44T","LA38",null,null,null,"Lorry: Drawbar HGV 26T to 38T"]
["Lorry: Articulated > 44T","LA44",null,null,null,"Lorry: Drawbar HGV 38T to 44T"]
["Lorry: Drawbar HGV < 26T","LD",null,null,null,"Coach: 17 passenger seats and over"]
["Lorry: Drawbar HGV 26T to 38T","LD26"]
["Lorry: Drawbar HGV 38T to 44T","LD38"]
["Bus: 17 passenger seats and over","BUS17"]
["Coach: 17 passenger seats and over","CO17"]
["Minibus: 9 -16 passenger seats","MINI9"]
["Car: up to 8 passenger seats","CAR17"]
["P2W (Motorcycle)","P2W"]
["Trailer","TRAIL"]
["Other","OTHR"]

{"sheet":"checker","index":4,"n_rows":23,"n_cols":10,"rows_kept":23,"cut":false,"hidden":true,"merged":[]}
[null,"1=required, 0=optional",1,2,3,4,5,6,7,8]
[null,null,null,null,"Audible turn left (Y/N)","Driver incab warning proximity sensors (Y/N)","Camera - rear (Y/N)","Camera - side (Y/N)\npost 2015","Audible reversing alarm (Y/N)","Fresnel lens (Y/N)\npre 2015\n\nOR CAMERA SIDE"]
[null,null,"Van: Light < 1.8T",null,0,0,0,0,0,0]
[null,null,"Van: Medium 1.8T to 2.6T",null,0,0,0,0,0,0]
[null,null,"Van: Heavy 2.6T to 3.5T",null,0,0,0,0,0,0]
[null,null,"Lorry: Rigid HGV 3.5T to 7.5T",null,1,1,0,1,1,1]
[null,null,"Lorry: Rigid HGV 7.5T to 18T",null,1,1,1,1,1,1]
[null,null,"Lorry: Rigid HGV 18T to 26T",null,1,1,1,1,1,1]
[null,null,"Lorry: Rigid HGV 26T to 32T",null,1,1,1,1,1,1]
[null,null,"Lorry: Articulated < 26T",null,1,1,0,1,1,1]
[null,null,"Lorry: Articulated 26T to 38T",null,1,1,0,1,1,1]
[null,null,"Lorry: Articulated 38T to 44T",null,1,1,0,1,1,1]
[null,null,"Lorry: Articulated > 44T",null,1,1,0,1,1,1]
[null,null,"Lorry: Drawbar HGV < 26T",null,1,1,0,1,1,1]
[null,null,"Lorry: Drawbar HGV 26T to 38T",null,1,1,0,1,1,1]
[null,null,"Lorry: Drawbar HGV 38T to 44T",null,1,1,0,1,1,1]
[null,null,"Bus: 17 passenger seats and over",null,0,0,0,0,0,0]
[null,null,"Coach: 17 passenger seats and over",null,0,0,0,0,0,0]
[null,null,"Minibus: 9 -16 passenger seats",null,0,0,0,0,0,0]
[null,null,"Car: up to 8 passenger seats",null,0,0,0,0,0,0]
[null,null,"P2W (Motorcycle)",null,0,0,0,0,0,0]
[null,null,"Trailer",null,0,0,0,0,0,0]
[null,null,"Other",null,0,0,0,0,0,0]